Sun Oct  4 20:54:50 2026 ===  0.000000 === build starting
Sun Oct  4 20:54:50 2026 ===  0.000249 === version 20190516
Sun Oct  4 20:54:50 2026 ===  0.000107 === hostname pkgsrchostname
Sun Oct  4 20:54:50 2026 ===  0.001264 === compilers/abiname.c compiling gcc -fPIC -Wall -fomit-frame-pointer -fwrapv -O3
Sun Oct  4 20:54:51 2026 ===  0.432864 === compilers/abiname.c compiling gcc -fPIC -Wall -fomit-frame-pointer -fwrapv -march=core-avx2 -O3
Sun Oct  4 20:54:51 2026 ===  0.039484 === output
> cc1: error: unknown value ‘core-avx2’ for ‘-march’
> cc1: note: valid arguments are: armv8-a armv8.1-a armv8.2-a armv8.3-a armv8.4-a armv8.5-a armv8.6-a native
Sun Oct  4 20:54:51 2026 ===  0.002906 === compilers/abiname.c compiler exited 1
Sun Oct  4 20:54:51 2026 ===  0.037489 === output
> cc1: error: unknown value ‘core-avx2’ for ‘-march’
> cc1: note: valid arguments are: armv8-a armv8.1-a armv8.2-a armv8.3-a armv8.4-a armv8.5-a armv8.6-a native
Sun Oct  4 20:54:51 2026 ===  0.001204 === compilers/base.c compiler exited 1
Sun Oct  4 20:54:51 2026 ===  0.017341 === compilers/abiname.c compiling clang -fPIC -Wall -fomit-frame-pointer -fwrapv -Qunused-arguments -O3
Sun Oct  4 20:54:51 2026 ===  0.026431 === output
> gcc: error: unrecognized command-line option ‘-Qunused-arguments’
Sun Oct  4 20:54:51 2026 ===  0.002510 === compilers/abiname.c compiler exited 1
Sun Oct  4 20:54:51 2026 ===  0.025312 === output
> gcc: error: unrecognized command-line option ‘-Qunused-arguments’
Sun Oct  4 20:54:51 2026 ===  0.001183 === compilers/base.c compiler exited 1
Sun Oct  4 20:54:51 2026 ===  0.034309 === compilers/abiname.c compiling clang -fPIC -Wall -fomit-frame-pointer -fwrapv -Qunused-arguments -mavx2 -O3
Sun Oct  4 20:54:51 2026 ===  0.032619 === output
> gcc: error: unrecognized command-line option ‘-Qunused-arguments’
> gcc: error: unrecognized command-line option ‘-mavx2’
Sun Oct  4 20:54:51 2026 ===  0.002512 === compilers/abiname.c compiler exited 1
Sun Oct  4 20:54:51 2026 ===  0.045408 === output
> gcc: error: unrecognized command-line option ‘-Qunused-arguments’
> gcc: error: unrecognized command-line option ‘-mavx2’
Sun Oct  4 20:54:51 2026 ===  0.001095 === compilers/base.c compiler exited 1
Sun Oct  4 20:54:51 2026 ===  0.020520 === cpucycles/amd64cpuinfo skipping architecture gcc -fPIC -Wall -fomit-frame-pointer -fwrapv -O3
Sun Oct  4 20:54:51 2026 ===  0.000493 === cpucycles/amd64cpuinfo skipping architecture gcc -fPIC -Wall -fomit-frame-pointer -fwrapv -march=core-avx2 -O3
Sun Oct  4 20:54:51 2026 ===  0.000316 === cpucycles/amd64cpuinfo skipping architecture clang -fPIC -Wall -fomit-frame-pointer -fwrapv -Qunused-arguments -O3
Sun Oct  4 20:54:51 2026 ===  0.000336 === cpucycles/amd64cpuinfo skipping architecture clang -fPIC -Wall -fomit-frame-pointer -fwrapv -Qunused-arguments -mavx2 -O3
Sun Oct  4 20:54:51 2026 ===  0.000409 === cpucycles/amd64cpuspeed skipping architecture gcc -fPIC -Wall -fomit-frame-pointer -fwrapv -O3
Sun Oct  4 20:54:51 2026 ===  0.000298 === cpucycles/amd64cpuspeed skipping architecture gcc -fPIC -Wall -fomit-frame-pointer -fwrapv -march=core-avx2 -O3
Sun Oct  4 20:54:51 2026 ===  0.000288 === cpucycles/amd64cpuspeed skipping architecture clang -fPIC -Wall -fomit-frame-pointer -fwrapv -Qunused-arguments -O3
Sun Oct  4 20:54:51 2026 ===  0.000288 === cpucycles/amd64cpuspeed skipping architecture clang -fPIC -Wall -fomit-frame-pointer -fwrapv -Qunused-arguments -mavx2 -O3
Sun Oct  4 20:54:51 2026 ===  0.000369 === cpucycles/amd64tscfreq skipping architecture gcc -fPIC -Wall -fomit-frame-pointer -fwrapv -O3
Sun Oct  4 20:54:51 2026 ===  0.000291 === cpucycles/amd64tscfreq skipping architecture gcc -fPIC -Wall -fomit-frame-pointer -fwrapv -march=core-avx2 -O3
Sun Oct  4 20:54:51 2026 ===  0.000277 === cpucycles/amd64tscfreq skipping architecture clang -fPIC -Wall -fomit-frame-pointer -fwrapv -Qunused-arguments -O3
Sun Oct  4 20:54:51 2026 ===  0.000278 === cpucycles/amd64tscfreq skipping architecture clang -fPIC -Wall -fomit-frame-pointer -fwrapv -Qunused-arguments -mavx2 -O3
Sun Oct  4 20:54:51 2026 ===  0.000243 === cpucycles/apple compiling gcc -fPIC -Wall -fomit-frame-pointer -fwrapv -O3
Sun Oct  4 20:54:51 2026 ===  0.200098 === output
> cpucycles.c:6:10: fatal error: mach/mach_time.h: No such file or directory
>     6 | #include <mach/mach_time.h>
>       |          ^~~~~~~~~~~~~~~~~~
> compilation terminated.
Sun Oct  4 20:54:51 2026 ===  0.002626 === cpucycles/cpucycles.c compiler exited 1
Sun Oct  4 20:54:51 2026 ===  0.000281 === cpucycles/apple compiling gcc -fPIC -Wall -fomit-frame-pointer -fwrapv -march=core-avx2 -O3
Sun Oct  4 20:54:51 2026 ===  0.174454 === output
> cc1: error: unknown value ‘core-avx2’ for ‘-march’
> cc1: note: valid arguments are: armv8-a armv8.1-a armv8.2-a armv8.3-a armv8.4-a armv8.5-a armv8.6-a native
Sun Oct  4 20:54:51 2026 ===  0.001734 === cpucycles/cpucycles.c compiler exited 1
Sun Oct  4 20:54:51 2026 ===  0.000272 === cpucycles/apple compiling clang -fPIC -Wall -fomit-frame-pointer -fwrapv -Qunused-arguments -O3
Sun Oct  4 20:54:52 2026 ===  0.054477 === output
> gcc: error: unrecognized command-line option ‘-Qunused-arguments’
Sun Oct  4 20:54:52 2026 ===  0.001728 === cpucycles/cpucycles.c compiler exited 1
Sun Oct  4 20:54:52 2026 ===  0.029737 === cpucycles/apple compiling clang -fPIC -Wall -fomit-frame-pointer -fwrapv -Qunused-arguments -mavx2 -O3
Sun Oct  4 20:54:52 2026 ===  0.057608 === output
> gcc: error: unrecognized command-line option ‘-Qunused-arguments’
> gcc: error: unrecognized command-line option ‘-mavx2’
Sun Oct  4 20:54:52 2026 ===  0.001844 === cpucycles/cpucycles.c compiler exited 1
Sun Oct  4 20:54:52 2026 ===  0.000637 === cpucycles/celllinux skipping architecture gcc -fPIC -Wall -fomit-frame-pointer -fwrapv -O3
Sun Oct  4 20:54:52 2026 ===  0.000310 === cpucycles/celllinux skipping architecture gcc -fPIC -Wall -fomit-frame-pointer -fwrapv -march=core-avx2 -O3
Sun Oct  4 20:54:52 2026 ===  0.000276 === cpucycles/celllinux skipping architecture clang -fPIC -Wall -fomit-frame-pointer -fwrapv -Qunused-arguments -O3
Sun Oct  4 20:54:52 2026 ===  0.000282 === cpucycles/celllinux skipping architecture clang -fPIC -Wall -fomit-frame-pointer -fwrapv -Qunused-arguments -mavx2 -O3
Sun Oct  4 20:54:52 2026 ===  0.000327 === cpucycles/cortex compiling gcc -fPIC -Wall -fomit-frame-pointer -fwrapv -O3
Sun Oct  4 20:54:52 2026 ===  0.200282 === output
> cpucycles.c:29:18: warning: ‘cyclespersec’ defined but not used [-Wunused-variable]
>    29 | static long long cyclespersec = 0;
>       |                  ^~~~~~~~~~~~
> cpucycles.c:28:12: warning: ‘now’ defined but not used [-Wunused-variable]
>    28 | static int now[3];
>       |            ^~~
> cpucycles.c:27:27: warning: ‘prevcycles’ defined but not used [-Wunused-variable]
>    27 | static unsigned long long prevcycles = 0;
>       |                           ^~~~~~~~~~
> cpucycles.c:26:12: warning: ‘prev’ defined but not used [-Wunused-variable]
>    26 | static int prev[3];
>       |            ^~~~
> cpucycles.c:24:12: warning: ‘enabled’ defined but not used [-Wunused-variable]
>    24 | static int enabled = 0;
>       |            ^~~~~~~
Sun Oct  4 20:54:52 2026 ===  0.478780 === cpucycles/cortex compiling gcc -fPIC -Wall -fomit-frame-pointer -fwrapv -march=core-avx2 -O3
Sun Oct  4 20:54:53 2026 ===  0.249829 === output
> cc1: error: unknown value ‘core-avx2’ for ‘-march’
> cc1: note: valid arguments are: armv8-a armv8.1-a armv8.2-a armv8.3-a armv8.4-a armv8.5-a armv8.6-a native
Sun Oct  4 20:54:53 2026 ===  0.001158 === cpucycles/cpucycles.c compiler exited 1
Sun Oct  4 20:54:53 2026 ===  0.006832 === cpucycles/cortex compiling clang -fPIC -Wall -fomit-frame-pointer -fwrapv -Qunused-arguments -O3
Sun Oct  4 20:54:53 2026 ===  0.031839 === output
> gcc: error: unrecognized command-line option ‘-Qunused-arguments’
Sun Oct  4 20:54:53 2026 ===  0.001132 === cpucycles/cpucycles.c compiler exited 1
Sun Oct  4 20:54:53 2026 ===  0.000588 === cpucycles/cortex compiling clang -fPIC -Wall -fomit-frame-pointer -fwrapv -Qunused-arguments -mavx2 -O3
Sun Oct  4 20:54:53 2026 ===  0.091151 === output
> gcc: error: unrecognized command-line option ‘-Qunused-arguments’
> gcc: error: unrecognized command-line option ‘-mavx2’
Sun Oct  4 20:54:53 2026 ===  0.001128 === cpucycles/cpucycles.c compiler exited 1
Sun Oct  4 20:54:53 2026 ===  0.000619 === cpucycles/cortex_vct compiling gcc -fPIC -Wall -fomit-frame-pointer -fwrapv -O3
Sun Oct  4 20:54:53 2026 ===  0.546519 === cpucycles/cortex_vct compiling gcc -fPIC -Wall -fomit-frame-pointer -fwrapv -march=core-avx2 -O3
Sun Oct  4 20:54:53 2026 ===  0.044969 === output
> cc1: error: unknown value ‘core-avx2’ for ‘-march’
> cc1: note: valid arguments are: armv8-a armv8.1-a armv8.2-a armv8.3-a armv8.4-a armv8.5-a armv8.6-a native
Sun Oct  4 20:54:53 2026 ===  0.001070 === cpucycles/cpucycles.c compiler exited 1
Sun Oct  4 20:54:53 2026 ===  0.000587 === cpucycles/cortex_vct compiling clang -fPIC -Wall -fomit-frame-pointer -fwrapv -Qunused-arguments -O3
Sun Oct  4 20:54:53 2026 ===  0.032049 === output
> gcc: error: unrecognized command-line option ‘-Qunused-arguments’
Sun Oct  4 20:54:53 2026 ===  0.001180 === cpucycles/cpucycles.c compiler exited 1
Sun Oct  4 20:54:53 2026 ===  0.000612 === cpucycles/cortex_vct compiling clang -fPIC -Wall -fomit-frame-pointer -fwrapv -Qunused-arguments -mavx2 -O3
Sun Oct  4 20:54:53 2026 ===  0.033610 === output
> gcc: error: unrecognized command-line option ‘-Qunused-arguments’
> gcc: error: unrecognized command-line option ‘-mavx2’
Sun Oct  4 20:54:53 2026 ===  0.001133 === cpucycles/cpucycles.c compiler exited 1
Sun Oct  4 20:54:53 2026 ===  0.000343 === cpucycles/dev4ns compiling gcc -fPIC -Wall -fomit-frame-pointer -fwrapv -O3
Sun Oct  4 20:54:54 2026 ===  0.594001 === cpucycles/dev4ns compiling gcc -fPIC -Wall -fomit-frame-pointer -fwrapv -march=core-avx2 -O3
Sun Oct  4 20:54:54 2026 ===  0.046338 === output
> cc1: error: unknown value ‘core-avx2’ for ‘-march’
> cc1: note: valid arguments are: armv8-a armv8.1-a armv8.2-a armv8.3-a armv8.4-a armv8.5-a armv8.6-a native
Sun Oct  4 20:54:54 2026 ===  0.001139 === cpucycles/cpucycles.c compiler exited 1
Sun Oct  4 20:54:54 2026 ===  0.000259 === cpucycles/dev4ns compiling clang -fPIC -Wall -fomit-frame-pointer -fwrapv -Qunused-arguments -O3
Sun Oct  4 20:54:54 2026 ===  0.032868 === output
> gcc: error: unrecognized command-line option ‘-Qunused-arguments’
Sun Oct  4 20:54:54 2026 ===  0.001094 === cpucycles/cpucycles.c compiler exited 1
Sun Oct  4 20:54:54 2026 ===  0.000244 === cpucycles/dev4ns compiling clang -fPIC -Wall -fomit-frame-pointer -fwrapv -Qunused-arguments -mavx2 -O3
Sun Oct  4 20:54:54 2026 ===  0.032730 === output
> gcc: error: unrecognized command-line option ‘-Qunused-arguments’
> gcc: error: unrecognized command-line option ‘-mavx2’
Sun Oct  4 20:54:54 2026 ===  0.001164 === cpucycles/cpucycles.c compiler exited 1
Sun Oct  4 20:54:54 2026 ===  0.000379 === cpucycles/gettimeofday compiling gcc -fPIC -Wall -fomit-frame-pointer -fwrapv -O3
Sun Oct  4 20:54:55 2026 ===  0.870587 === cpucycles/gettimeofday compiling gcc -fPIC -Wall -fomit-frame-pointer -fwrapv -march=core-avx2 -O3
Sun Oct  4 20:54:55 2026 ===  0.130579 === output
> cc1: error: unknown value ‘core-avx2’ for ‘-march’
> cc1: note: valid arguments are: armv8-a armv8.1-a armv8.2-a armv8.3-a armv8.4-a armv8.5-a armv8.6-a native
Sun Oct  4 20:54:55 2026 ===  0.001269 === cpucycles/cpucycles.c compiler exited 1
Sun Oct  4 20:54:55 2026 ===  0.000321 === cpucycles/gettimeofday compiling clang -fPIC -Wall -fomit-frame-pointer -fwrapv -Qunused-arguments -O3
Sun Oct  4 20:54:55 2026 ===  0.049061 === output
> gcc: error: unrecognized command-line option ‘-Qunused-arguments’
Sun Oct  4 20:54:55 2026 ===  0.001131 === cpucycles/cpucycles.c compiler exited 1
Sun Oct  4 20:54:55 2026 ===  0.000265 === cpucycles/gettimeofday compiling clang -fPIC -Wall -fomit-frame-pointer -fwrapv -Qunused-arguments -mavx2 -O3
Sun Oct  4 20:54:55 2026 ===  0.036713 === output
> gcc: error: unrecognized command-line option ‘-Qunused-arguments’
> gcc: error: unrecognized command-line option ‘-mavx2’
Sun Oct  4 20:54:55 2026 ===  0.001233 === cpucycles/cpucycles.c compiler exited 1
Sun Oct  4 20:54:55 2026 ===  0.000681 === cpucycles/ia64cpuinfo skipping architecture gcc -fPIC -Wall -fomit-frame-pointer -fwrapv -O3
Sun Oct  4 20:54:55 2026 ===  0.000335 === cpucycles/ia64cpuinfo skipping architecture gcc -fPIC -Wall -fomit-frame-pointer -fwrapv -march=core-avx2 -O3
Sun Oct  4 20:54:55 2026 ===  0.000317 === cpucycles/ia64cpuinfo skipping architecture clang -fPIC -Wall -fomit-frame-pointer -fwrapv -Qunused-arguments -O3
Sun Oct  4 20:54:55 2026 ===  0.000289 === cpucycles/ia64cpuinfo skipping architecture clang -fPIC -Wall -fomit-frame-pointer -fwrapv -Qunused-arguments -mavx2 -O3
Sun Oct  4 20:54:55 2026 ===  0.000379 === cpucycles/mips skipping architecture gcc -fPIC -Wall -fomit-frame-pointer -fwrapv -O3
Sun Oct  4 20:54:55 2026 ===  0.000312 === cpucycles/mips skipping architecture gcc -fPIC -Wall -fomit-frame-pointer -fwrapv -march=core-avx2 -O3
Sun Oct  4 20:54:55 2026 ===  0.000292 === cpucycles/mips skipping architecture clang -fPIC -Wall -fomit-frame-pointer -fwrapv -Qunused-arguments -O3
Sun Oct  4 20:54:55 2026 ===  0.000281 === cpucycles/mips skipping architecture clang -fPIC -Wall -fomit-frame-pointer -fwrapv -Qunused-arguments -mavx2 -O3
Sun Oct  4 20:54:55 2026 ===  0.000205 === cpucycles/monotonic compiling gcc -fPIC -Wall -fomit-frame-pointer -fwrapv -O3
Sun Oct  4 20:54:56 2026 ===  0.641411 === cpucycles/monotonic compiling gcc -fPIC -Wall -fomit-frame-pointer -fwrapv -march=core-avx2 -O3
Sun Oct  4 20:54:56 2026 ===  0.045507 === output
> cc1: error: unknown value ‘core-avx2’ for ‘-march’
> cc1: note: valid arguments are: armv8-a armv8.1-a armv8.2-a armv8.3-a armv8.4-a armv8.5-a armv8.6-a native
Sun Oct  4 20:54:56 2026 ===  0.001066 === cpucycles/cpucycles.c compiler exited 1
Sun Oct  4 20:54:56 2026 ===  0.000224 === cpucycles/monotonic compiling clang -fPIC -Wall -fomit-frame-pointer -fwrapv -Qunused-arguments -O3
Sun Oct  4 20:54:56 2026 ===  0.032975 === output
> gcc: error: unrecognized command-line option ‘-Qunused-arguments’
Sun Oct  4 20:54:56 2026 ===  0.000933 === cpucycles/cpucycles.c compiler exited 1
Sun Oct  4 20:54:56 2026 ===  0.000231 === cpucycles/monotonic compiling clang -fPIC -Wall -fomit-frame-pointer -fwrapv -Qunused-arguments -mavx2 -O3
Sun Oct  4 20:54:56 2026 ===  0.034106 === output
> gcc: error: unrecognized command-line option ‘-Qunused-arguments’
> gcc: error: unrecognized command-line option ‘-mavx2’
Sun Oct  4 20:54:56 2026 ===  0.001090 === cpucycles/cpucycles.c compiler exited 1
Sun Oct  4 20:54:56 2026 ===  0.000325 === cpucycles/monotoniccpuinfo compiling gcc -fPIC -Wall -fomit-frame-pointer -fwrapv -O3
Sun Oct  4 20:54:57 2026 ===  0.705641 === cpucycles/monotoniccpuinfo compiling gcc -fPIC -Wall -fomit-frame-pointer -fwrapv -march=core-avx2 -O3
Sun Oct  4 20:54:57 2026 ===  0.068602 === output
> cc1: error: unknown value ‘core-avx2’ for ‘-march’
> cc1: note: valid arguments are: armv8-a armv8.1-a armv8.2-a armv8.3-a armv8.4-a armv8.5-a armv8.6-a native
Sun Oct  4 20:54:57 2026 ===  0.002218 === cpucycles/cpucycles.c compiler exited 1
Sun Oct  4 20:54:57 2026 ===  0.000290 === cpucycles/monotoniccpuinfo compiling clang -fPIC -Wall -fomit-frame-pointer -fwrapv -Qunused-arguments -O3
Sun Oct  4 20:54:57 2026 ===  0.056590 === output
> gcc: error: unrecognized command-line option ‘-Qunused-arguments’
Sun Oct  4 20:54:57 2026 ===  0.001086 === cpucycles/cpucycles.c compiler exited 1
Sun Oct  4 20:54:57 2026 ===  0.000267 === cpucycles/monotoniccpuinfo compiling clang -fPIC -Wall -fomit-frame-pointer -fwrapv -Qunused-arguments -mavx2 -O3
Sun Oct  4 20:54:57 2026 ===  0.032852 === output
> gcc: error: unrecognized command-line option ‘-Qunused-arguments’
> gcc: error: unrecognized command-line option ‘-mavx2’
Sun Oct  4 20:54:57 2026 ===  0.001095 === cpucycles/cpucycles.c compiler exited 1
Sun Oct  4 20:54:57 2026 ===  0.000361 === cpucycles/perfevent compiling gcc -fPIC -Wall -fomit-frame-pointer -fwrapv -O3
Sun Oct  4 20:54:57 2026 ===  0.139466 === output
> cpucycles.c:6:10: fatal error: linux/perf_event.h: No such file or directory
>     6 | #include <linux/perf_event.h>
>       |          ^~~~~~~~~~~~~~~~~~~~
> compilation terminated.
Sun Oct  4 20:54:57 2026 ===  0.001167 === cpucycles/cpucycles.c compiler exited 1
Sun Oct  4 20:54:57 2026 ===  0.000282 === cpucycles/perfevent compiling gcc -fPIC -Wall -fomit-frame-pointer -fwrapv -march=core-avx2 -O3
Sun Oct  4 20:54:57 2026 ===  0.058438 === output
> cc1: error: unknown value ‘core-avx2’ for ‘-march’
> cc1: note: valid arguments are: armv8-a armv8.1-a armv8.2-a armv8.3-a armv8.4-a armv8.5-a armv8.6-a native
Sun Oct  4 20:54:57 2026 ===  0.001186 === cpucycles/cpucycles.c compiler exited 1
Sun Oct  4 20:54:57 2026 ===  0.000261 === cpucycles/perfevent compiling clang -fPIC -Wall -fomit-frame-pointer -fwrapv -Qunused-arguments -O3
Sun Oct  4 20:54:57 2026 ===  0.031273 === output
> gcc: error: unrecognized command-line option ‘-Qunused-arguments’
Sun Oct  4 20:54:57 2026 ===  0.001076 === cpucycles/cpucycles.c compiler exited 1
Sun Oct  4 20:54:57 2026 ===  0.000258 === cpucycles/perfevent compiling clang -fPIC -Wall -fomit-frame-pointer -fwrapv -Qunused-arguments -mavx2 -O3
Sun Oct  4 20:54:57 2026 ===  0.033743 === output
> gcc: error: unrecognized command-line option ‘-Qunused-arguments’
> gcc: error: unrecognized command-line option ‘-mavx2’
Sun Oct  4 20:54:57 2026 ===  0.001125 === cpucycles/cpucycles.c compiler exited 1
Sun Oct  4 20:54:57 2026 ===  0.000623 === cpucycles/powerpccpuinfo skipping architecture gcc -fPIC -Wall -fomit-frame-pointer -fwrapv -O3
Sun Oct  4 20:54:57 2026 ===  0.000311 === cpucycles/powerpccpuinfo skipping architecture gcc -fPIC -Wall -fomit-frame-pointer -fwrapv -march=core-avx2 -O3
Sun Oct  4 20:54:57 2026 ===  0.000297 === cpucycles/powerpccpuinfo skipping architecture clang -fPIC -Wall -fomit-frame-pointer -fwrapv -Qunused-arguments -O3
Sun Oct  4 20:54:57 2026 ===  0.000300 === cpucycles/powerpccpuinfo skipping architecture clang -fPIC -Wall -fomit-frame-pointer -fwrapv -Qunused-arguments -mavx2 -O3
Sun Oct  4 20:54:57 2026 ===  0.000363 === cpucycles/powerpcmacos skipping architecture gcc -fPIC -Wall -fomit-frame-pointer -fwrapv -O3
Sun Oct  4 20:54:57 2026 ===  0.000284 === cpucycles/powerpcmacos skipping architecture gcc -fPIC -Wall -fomit-frame-pointer -fwrapv -march=core-avx2 -O3
Sun Oct  4 20:54:57 2026 ===  0.000289 === cpucycles/powerpcmacos skipping architecture clang -fPIC -Wall -fomit-frame-pointer -fwrapv -Qunused-arguments -O3
Sun Oct  4 20:54:57 2026 ===  0.000287 === cpucycles/powerpcmacos skipping architecture clang -fPIC -Wall -fomit-frame-pointer -fwrapv -Qunused-arguments -mavx2 -O3
Sun Oct  4 20:54:57 2026 ===  0.000344 === cpucycles/sparc32cpuinfo skipping architecture gcc -fPIC -Wall -fomit-frame-pointer -fwrapv -O3
Sun Oct  4 20:54:57 2026 ===  0.000285 === cpucycles/sparc32cpuinfo skipping architecture gcc -fPIC -Wall -fomit-frame-pointer -fwrapv -march=core-avx2 -O3
Sun Oct  4 20:54:57 2026 ===  0.000277 === cpucycles/sparc32cpuinfo skipping architecture clang -fPIC -Wall -fomit-frame-pointer -fwrapv -Qunused-arguments -O3
Sun Oct  4 20:54:57 2026 ===  0.000270 === cpucycles/sparc32cpuinfo skipping architecture clang -fPIC -Wall -fomit-frame-pointer -fwrapv -Qunused-arguments -mavx2 -O3
Sun Oct  4 20:54:57 2026 ===  0.000347 === cpucycles/sparccpuinfo skipping architecture gcc -fPIC -Wall -fomit-frame-pointer -fwrapv -O3
Sun Oct  4 20:54:57 2026 ===  0.000286 === cpucycles/sparccpuinfo skipping architecture gcc -fPIC -Wall -fomit-frame-pointer -fwrapv -march=core-avx2 -O3
Sun Oct  4 20:54:57 2026 ===  0.000283 === cpucycles/sparccpuinfo skipping architecture clang -fPIC -Wall -fomit-frame-pointer -fwrapv -Qunused-arguments -O3
Sun Oct  4 20:54:57 2026 ===  0.000280 === cpucycles/sparccpuinfo skipping architecture clang -fPIC -Wall -fomit-frame-pointer -fwrapv -Qunused-arguments -mavx2 -O3
Sun Oct  4 20:54:57 2026 ===  0.000364 === cpucycles/vct compiling gcc -fPIC -Wall -fomit-frame-pointer -fwrapv -O3
Sun Oct  4 20:54:58 2026 ===  0.779003 === cpucycles/vct compiling gcc -fPIC -Wall -fomit-frame-pointer -fwrapv -march=core-avx2 -O3
Sun Oct  4 20:54:58 2026 ===  0.044897 === output
> cc1: error: unknown value ‘core-avx2’ for ‘-march’
> cc1: note: valid arguments are: armv8-a armv8.1-a armv8.2-a armv8.3-a armv8.4-a armv8.5-a armv8.6-a native
Sun Oct  4 20:54:58 2026 ===  0.001022 === cpucycles/cpucycles.c compiler exited 1
Sun Oct  4 20:54:58 2026 ===  0.000467 === cpucycles/vct compiling clang -fPIC -Wall -fomit-frame-pointer -fwrapv -Qunused-arguments -O3
Sun Oct  4 20:54:58 2026 ===  0.030691 === output
> gcc: error: unrecognized command-line option ‘-Qunused-arguments’
Sun Oct  4 20:54:58 2026 ===  0.000993 === cpucycles/cpucycles.c compiler exited 1
Sun Oct  4 20:54:58 2026 ===  0.000456 === cpucycles/vct compiling clang -fPIC -Wall -fomit-frame-pointer -fwrapv -Qunused-arguments -mavx2 -O3
Sun Oct  4 20:54:58 2026 ===  0.031668 === output
> gcc: error: unrecognized command-line option ‘-Qunused-arguments’
> gcc: error: unrecognized command-line option ‘-mavx2’
Sun Oct  4 20:54:58 2026 ===  0.001061 === cpucycles/cpucycles.c compiler exited 1
Sun Oct  4 20:54:58 2026 ===  0.000600 === cpucycles/x86cpuinfo skipping architecture gcc -fPIC -Wall -fomit-frame-pointer -fwrapv -O3
Sun Oct  4 20:54:58 2026 ===  0.000299 === cpucycles/x86cpuinfo skipping architecture gcc -fPIC -Wall -fomit-frame-pointer -fwrapv -march=core-avx2 -O3
Sun Oct  4 20:54:58 2026 ===  0.000291 === cpucycles/x86cpuinfo skipping architecture clang -fPIC -Wall -fomit-frame-pointer -fwrapv -Qunused-arguments -O3
Sun Oct  4 20:54:58 2026 ===  0.000293 === cpucycles/x86cpuinfo skipping architecture clang -fPIC -Wall -fomit-frame-pointer -fwrapv -Qunused-arguments -mavx2 -O3
Sun Oct  4 20:54:58 2026 ===  0.000347 === cpucycles/x86cpuspeed skipping architecture gcc -fPIC -Wall -fomit-frame-pointer -fwrapv -O3
Sun Oct  4 20:54:58 2026 ===  0.000275 === cpucycles/x86cpuspeed skipping architecture gcc -fPIC -Wall -fomit-frame-pointer -fwrapv -march=core-avx2 -O3
Sun Oct  4 20:54:58 2026 ===  0.000277 === cpucycles/x86cpuspeed skipping architecture clang -fPIC -Wall -fomit-frame-pointer -fwrapv -Qunused-arguments -O3
Sun Oct  4 20:54:58 2026 ===  0.000275 === cpucycles/x86cpuspeed skipping architecture clang -fPIC -Wall -fomit-frame-pointer -fwrapv -Qunused-arguments -mavx2 -O3
Sun Oct  4 20:54:58 2026 ===  0.000385 === cpucycles/x86estimate skipping architecture gcc -fPIC -Wall -fomit-frame-pointer -fwrapv -O3
Sun Oct  4 20:54:58 2026 ===  0.000269 === cpucycles/x86estimate skipping architecture gcc -fPIC -Wall -fomit-frame-pointer -fwrapv -march=core-avx2 -O3
Sun Oct  4 20:54:58 2026 ===  0.000272 === cpucycles/x86estimate skipping architecture clang -fPIC -Wall -fomit-frame-pointer -fwrapv -Qunused-arguments -O3
Sun Oct  4 20:54:58 2026 ===  0.000267 === cpucycles/x86estimate skipping architecture clang -fPIC -Wall -fomit-frame-pointer -fwrapv -Qunused-arguments -mavx2 -O3
Sun Oct  4 20:54:58 2026 ===  0.000306 === cpucycles/x86tscfreq skipping architecture gcc -fPIC -Wall -fomit-frame-pointer -fwrapv -O3
Sun Oct  4 20:54:58 2026 ===  0.000253 === cpucycles/x86tscfreq skipping architecture gcc -fPIC -Wall -fomit-frame-pointer -fwrapv -march=core-avx2 -O3
Sun Oct  4 20:54:58 2026 ===  0.000257 === cpucycles/x86tscfreq skipping architecture clang -fPIC -Wall -fomit-frame-pointer -fwrapv -Qunused-arguments -O3
Sun Oct  4 20:54:58 2026 ===  0.000246 === cpucycles/x86tscfreq skipping architecture clang -fPIC -Wall -fomit-frame-pointer -fwrapv -Qunused-arguments -mavx2 -O3
Sun Oct  4 20:54:58 2026 ===  0.008415 === int32/avx2 skipping architecture gcc -fPIC -Wall -fomit-frame-pointer -fwrapv -O3
Sun Oct  4 20:54:58 2026 ===  0.000338 === int32/avx2 skipping architecture gcc -fPIC -Wall -fomit-frame-pointer -fwrapv -march=core-avx2 -O3
Sun Oct  4 20:54:58 2026 ===  0.000261 === int32/avx2 skipping architecture clang -fPIC -Wall -fomit-frame-pointer -fwrapv -Qunused-arguments -O3
Sun Oct  4 20:54:58 2026 ===  0.000300 === int32/avx2 skipping architecture clang -fPIC -Wall -fomit-frame-pointer -fwrapv -Qunused-arguments -mavx2 -O3
Sun Oct  4 20:54:58 2026 ===  0.008215 === int32/portable3 compiling gcc -fPIC -Wall -fomit-frame-pointer -fwrapv -O3
Sun Oct  4 20:54:58 2026 ===  0.001417 === int32/portable3/sort.c compiling
Sun Oct  4 20:54:58 2026 ===  0.145322 === int32/portable3/compiler.c compiling
Sun Oct  4 20:54:58 2026 ===  0.095326 === int32/portable3/version.c compiling
Sun Oct  4 20:54:58 2026 ===  0.089954 === int32/portable3/implementation.c compiling
Sun Oct  4 20:54:58 2026 ===  0.119342 === int32/portable3/cycles.c compiling
Sun Oct  4 20:54:59 2026 ===  0.320266 === int32/portable3/works.c compiling
Sun Oct  4 20:55:00 2026 ===  0.792492 === int32/portable3 compiled gcc -fPIC -Wall -fomit-frame-pointer -fwrapv -O3
Sun Oct  4 20:55:00 2026 ===  0.054837 === int32/portable3 compiling gcc -fPIC -Wall -fomit-frame-pointer -fwrapv -march=core-avx2 -O3
Sun Oct  4 20:55:00 2026 ===  0.000920 === int32/portable3/sort.c compiling
Sun Oct  4 20:55:00 2026 ===  0.048101 === output
> cc1: error: unknown value ‘core-avx2’ for ‘-march’
> cc1: note: valid arguments are: armv8-a armv8.1-a armv8.2-a armv8.3-a armv8.4-a armv8.5-a armv8.6-a native
Sun Oct  4 20:55:00 2026 ===  0.002998 === int32/portable3/sort.c compiler exited 1
Sun Oct  4 20:55:00 2026 ===  0.000228 === int32/portable3/compiler.c compiling
Sun Oct  4 20:55:00 2026 ===  0.035622 === output
> cc1: error: unknown value ‘core-avx2’ for ‘-march’
> cc1: note: valid arguments are: armv8-a armv8.1-a armv8.2-a armv8.3-a armv8.4-a armv8.5-a armv8.6-a native
Sun Oct  4 20:55:00 2026 ===  0.001109 === int32/portable3/compiler.c compiler exited 1
Sun Oct  4 20:55:00 2026 ===  0.000193 === int32/portable3/version.c compiling
Sun Oct  4 20:55:00 2026 ===  0.037484 === output
> cc1: error: unknown value ‘core-avx2’ for ‘-march’
> cc1: note: valid arguments are: armv8-a armv8.1-a armv8.2-a armv8.3-a armv8.4-a armv8.5-a armv8.6-a native
Sun Oct  4 20:55:00 2026 ===  0.001160 === int32/portable3/version.c compiler exited 1
Sun Oct  4 20:55:00 2026 ===  0.000190 === int32/portable3/implementation.c compiling
Sun Oct  4 20:55:00 2026 ===  0.036135 === output
> cc1: error: unknown value ‘core-avx2’ for ‘-march’
> cc1: note: valid arguments are: armv8-a armv8.1-a armv8.2-a armv8.3-a armv8.4-a armv8.5-a armv8.6-a native
Sun Oct  4 20:55:00 2026 ===  0.001173 === int32/portable3/implementation.c compiler exited 1
Sun Oct  4 20:55:00 2026 ===  0.000223 === int32/portable3/cycles.c compiling
Sun Oct  4 20:55:00 2026 ===  0.036891 === output
> cc1: error: unknown value ‘core-avx2’ for ‘-march’
> cc1: note: valid arguments are: armv8-a armv8.1-a armv8.2-a armv8.3-a armv8.4-a armv8.5-a armv8.6-a native
Sun Oct  4 20:55:00 2026 ===  0.001161 === int32/portable3/cycles.c compiler exited 1
Sun Oct  4 20:55:00 2026 ===  0.000203 === int32/portable3/works.c compiling
Sun Oct  4 20:55:00 2026 ===  0.036059 === output
> cc1: error: unknown value ‘core-avx2’ for ‘-march’
> cc1: note: valid arguments are: armv8-a armv8.1-a armv8.2-a armv8.3-a armv8.4-a armv8.5-a armv8.6-a native
Sun Oct  4 20:55:00 2026 ===  0.001087 === int32/portable3/works.c compiler exited 1
Sun Oct  4 20:55:00 2026 ===  0.000211 === int32/portable3 compiling clang -fPIC -Wall -fomit-frame-pointer -fwrapv -Qunused-arguments -O3
Sun Oct  4 20:55:00 2026 ===  0.000665 === int32/portable3/sort.c compiling
Sun Oct  4 20:55:00 2026 ===  0.024727 === output
> gcc: error: unrecognized command-line option ‘-Qunused-arguments’
Sun Oct  4 20:55:00 2026 ===  0.002292 === int32/portable3/sort.c compiler exited 1
Sun Oct  4 20:55:00 2026 ===  0.000190 === int32/portable3/compiler.c compiling
Sun Oct  4 20:55:00 2026 ===  0.024167 === output
> gcc: error: unrecognized command-line option ‘-Qunused-arguments’
Sun Oct  4 20:55:00 2026 ===  0.001046 === int32/portable3/compiler.c compiler exited 1
Sun Oct  4 20:55:00 2026 ===  0.000185 === int32/portable3/version.c compiling
Sun Oct  4 20:55:00 2026 ===  0.026159 === output
> gcc: error: unrecognized command-line option ‘-Qunused-arguments’
Sun Oct  4 20:55:00 2026 ===  0.001098 === int32/portable3/version.c compiler exited 1
Sun Oct  4 20:55:00 2026 ===  0.000190 === int32/portable3/implementation.c compiling
Sun Oct  4 20:55:00 2026 ===  0.025578 === output
> gcc: error: unrecognized command-line option ‘-Qunused-arguments’
Sun Oct  4 20:55:00 2026 ===  0.001151 === int32/portable3/implementation.c compiler exited 1
Sun Oct  4 20:55:00 2026 ===  0.000212 === int32/portable3/cycles.c compiling
Sun Oct  4 20:55:00 2026 ===  0.026088 === output
> gcc: error: unrecognized command-line option ‘-Qunused-arguments’
Sun Oct  4 20:55:00 2026 ===  0.001129 === int32/portable3/cycles.c compiler exited 1
Sun Oct  4 20:55:00 2026 ===  0.000215 === int32/portable3/works.c compiling
Sun Oct  4 20:55:00 2026 ===  0.027041 === output
> gcc: error: unrecognized command-line option ‘-Qunused-arguments’
Sun Oct  4 20:55:00 2026 ===  0.001120 === int32/portable3/works.c compiler exited 1
Sun Oct  4 20:55:00 2026 ===  0.000256 === int32/portable3 compiling clang -fPIC -Wall -fomit-frame-pointer -fwrapv -Qunused-arguments -mavx2 -O3
Sun Oct  4 20:55:00 2026 ===  0.000728 === int32/portable3/sort.c compiling
Sun Oct  4 20:55:00 2026 ===  0.034827 === output
> gcc: error: unrecognized command-line option ‘-Qunused-arguments’
> gcc: error: unrecognized command-line option ‘-mavx2’
Sun Oct  4 20:55:00 2026 ===  0.002550 === int32/portable3/sort.c compiler exited 1
Sun Oct  4 20:55:00 2026 ===  0.000238 === int32/portable3/compiler.c compiling
Sun Oct  4 20:55:00 2026 ===  0.030052 === output
> gcc: error: unrecognized command-line option ‘-Qunused-arguments’
> gcc: error: unrecognized command-line option ‘-mavx2’
Sun Oct  4 20:55:00 2026 ===  0.001254 === int32/portable3/compiler.c compiler exited 1
Sun Oct  4 20:55:00 2026 ===  0.000210 === int32/portable3/version.c compiling
Sun Oct  4 20:55:00 2026 ===  0.087713 === output
> gcc: error: unrecognized command-line option ‘-Qunused-arguments’
> gcc: error: unrecognized command-line option ‘-mavx2’
Sun Oct  4 20:55:00 2026 ===  0.001140 === int32/portable3/version.c compiler exited 1
Sun Oct  4 20:55:00 2026 ===  0.000196 === int32/portable3/implementation.c compiling
Sun Oct  4 20:55:00 2026 ===  0.025960 === output
> gcc: error: unrecognized command-line option ‘-Qunused-arguments’
> gcc: error: unrecognized command-line option ‘-mavx2’
Sun Oct  4 20:55:00 2026 ===  0.001146 === int32/portable3/implementation.c compiler exited 1
Sun Oct  4 20:55:00 2026 ===  0.000205 === int32/portable3/cycles.c compiling
Sun Oct  4 20:55:00 2026 ===  0.030333 === output
> gcc: error: unrecognized command-line option ‘-Qunused-arguments’
> gcc: error: unrecognized command-line option ‘-mavx2’
Sun Oct  4 20:55:00 2026 ===  0.001212 === int32/portable3/cycles.c compiler exited 1
Sun Oct  4 20:55:00 2026 ===  0.000213 === int32/portable3/works.c compiling
Sun Oct  4 20:55:00 2026 ===  0.035143 === output
> gcc: error: unrecognized command-line option ‘-Qunused-arguments’
> gcc: error: unrecognized command-line option ‘-mavx2’
Sun Oct  4 20:55:00 2026 ===  0.001133 === int32/portable3/works.c compiler exited 1
Sun Oct  4 20:55:00 2026 ===  0.014851 === int32/portable4 compiling gcc -fPIC -Wall -fomit-frame-pointer -fwrapv -O3
Sun Oct  4 20:55:00 2026 ===  0.000777 === int32/portable4/sort.c compiling
Sun Oct  4 20:55:01 2026 ===  0.357860 === int32/portable4/compiler.c compiling
Sun Oct  4 20:55:01 2026 ===  0.084408 === int32/portable4/version.c compiling
Sun Oct  4 20:55:01 2026 ===  0.087555 === int32/portable4/implementation.c compiling
Sun Oct  4 20:55:01 2026 ===  0.122604 === int32/portable4/cycles.c compiling
Sun Oct  4 20:55:01 2026 ===  0.254369 === int32/portable4/works.c compiling
Sun Oct  4 20:55:02 2026 ===  0.804182 === int32/portable4 compiled gcc -fPIC -Wall -fomit-frame-pointer -fwrapv -O3
Sun Oct  4 20:55:02 2026 ===  0.048135 === int32/portable4 compiling gcc -fPIC -Wall -fomit-frame-pointer -fwrapv -march=core-avx2 -O3
Sun Oct  4 20:55:02 2026 ===  0.000833 === int32/portable4/sort.c compiling
Sun Oct  4 20:55:02 2026 ===  0.036629 === output
> cc1: error: unknown value ‘core-avx2’ for ‘-march’
> cc1: note: valid arguments are: armv8-a armv8.1-a armv8.2-a armv8.3-a armv8.4-a armv8.5-a armv8.6-a native
Sun Oct  4 20:55:02 2026 ===  0.001776 === int32/portable4/sort.c compiler exited 1
Sun Oct  4 20:55:02 2026 ===  0.000222 === int32/portable4/compiler.c compiling
Sun Oct  4 20:55:02 2026 ===  0.041247 === output
> cc1: error: unknown value ‘core-avx2’ for ‘-march’
> cc1: note: valid arguments are: armv8-a armv8.1-a armv8.2-a armv8.3-a armv8.4-a armv8.5-a armv8.6-a native
Sun Oct  4 20:55:02 2026 ===  0.001155 === int32/portable4/compiler.c compiler exited 1
Sun Oct  4 20:55:02 2026 ===  0.000242 === int32/portable4/version.c compiling
Sun Oct  4 20:55:02 2026 ===  0.038518 === output
> cc1: error: unknown value ‘core-avx2’ for ‘-march’
> cc1: note: valid arguments are: armv8-a armv8.1-a armv8.2-a armv8.3-a armv8.4-a armv8.5-a armv8.6-a native
Sun Oct  4 20:55:02 2026 ===  0.001250 === int32/portable4/version.c compiler exited 1
Sun Oct  4 20:55:02 2026 ===  0.000216 === int32/portable4/implementation.c compiling
Sun Oct  4 20:55:02 2026 ===  0.037458 === output
> cc1: error: unknown value ‘core-avx2’ for ‘-march’
> cc1: note: valid arguments are: armv8-a armv8.1-a armv8.2-a armv8.3-a armv8.4-a armv8.5-a armv8.6-a native
Sun Oct  4 20:55:02 2026 ===  0.001116 === int32/portable4/implementation.c compiler exited 1
Sun Oct  4 20:55:02 2026 ===  0.000240 === int32/portable4/cycles.c compiling
Sun Oct  4 20:55:02 2026 ===  0.117442 === output
> cc1: error: unknown value ‘core-avx2’ for ‘-march’
> cc1: note: valid arguments are: armv8-a armv8.1-a armv8.2-a armv8.3-a armv8.4-a armv8.5-a armv8.6-a native
Sun Oct  4 20:55:02 2026 ===  0.001185 === int32/portable4/cycles.c compiler exited 1
Sun Oct  4 20:55:02 2026 ===  0.000210 === int32/portable4/works.c compiling
Sun Oct  4 20:55:02 2026 ===  0.053940 === output
> cc1: error: unknown value ‘core-avx2’ for ‘-march’
> cc1: note: valid arguments are: armv8-a armv8.1-a armv8.2-a armv8.3-a armv8.4-a armv8.5-a armv8.6-a native
Sun Oct  4 20:55:02 2026 ===  0.001217 === int32/portable4/works.c compiler exited 1
Sun Oct  4 20:55:02 2026 ===  0.000284 === int32/portable4 compiling clang -fPIC -Wall -fomit-frame-pointer -fwrapv -Qunused-arguments -O3
Sun Oct  4 20:55:02 2026 ===  0.000750 === int32/portable4/sort.c compiling
Sun Oct  4 20:55:02 2026 ===  0.040996 === output
> gcc: error: unrecognized command-line option ‘-Qunused-arguments’
Sun Oct  4 20:55:02 2026 ===  0.001656 === int32/portable4/sort.c compiler exited 1
Sun Oct  4 20:55:02 2026 ===  0.000196 === int32/portable4/compiler.c compiling
Sun Oct  4 20:55:02 2026 ===  0.025792 === output
> gcc: error: unrecognized command-line option ‘-Qunused-arguments’
Sun Oct  4 20:55:02 2026 ===  0.001092 === int32/portable4/compiler.c compiler exited 1
Sun Oct  4 20:55:02 2026 ===  0.000225 === int32/portable4/version.c compiling
Sun Oct  4 20:55:02 2026 ===  0.025529 === output
> gcc: error: unrecognized command-line option ‘-Qunused-arguments’
Sun Oct  4 20:55:02 2026 ===  0.001112 === int32/portable4/version.c compiler exited 1
Sun Oct  4 20:55:02 2026 ===  0.000195 === int32/portable4/implementation.c compiling
Sun Oct  4 20:55:02 2026 ===  0.024971 === output
> gcc: error: unrecognized command-line option ‘-Qunused-arguments’
Sun Oct  4 20:55:02 2026 ===  0.001145 === int32/portable4/implementation.c compiler exited 1
Sun Oct  4 20:55:02 2026 ===  0.000207 === int32/portable4/cycles.c compiling
Sun Oct  4 20:55:02 2026 ===  0.028955 === output
> gcc: error: unrecognized command-line option ‘-Qunused-arguments’
Sun Oct  4 20:55:02 2026 ===  0.001102 === int32/portable4/cycles.c compiler exited 1
Sun Oct  4 20:55:02 2026 ===  0.000191 === int32/portable4/works.c compiling
Sun Oct  4 20:55:03 2026 ===  0.024303 === output
> gcc: error: unrecognized command-line option ‘-Qunused-arguments’
Sun Oct  4 20:55:03 2026 ===  0.001075 === int32/portable4/works.c compiler exited 1
Sun Oct  4 20:55:03 2026 ===  0.000260 === int32/portable4 compiling clang -fPIC -Wall -fomit-frame-pointer -fwrapv -Qunused-arguments -mavx2 -O3
Sun Oct  4 20:55:03 2026 ===  0.000763 === int32/portable4/sort.c compiling
Sun Oct  4 20:55:03 2026 ===  0.057949 === output
> gcc: error: unrecognized command-line option ‘-Qunused-arguments’
> gcc: error: unrecognized command-line option ‘-mavx2’
Sun Oct  4 20:55:03 2026 ===  0.001809 === int32/portable4/sort.c compiler exited 1
Sun Oct  4 20:55:03 2026 ===  0.000248 === int32/portable4/compiler.c compiling
Sun Oct  4 20:55:03 2026 ===  0.042576 === output
> gcc: error: unrecognized command-line option ‘-Qunused-arguments’
> gcc: error: unrecognized command-line option ‘-mavx2’
Sun Oct  4 20:55:03 2026 ===  0.001204 === int32/portable4/compiler.c compiler exited 1
Sun Oct  4 20:55:03 2026 ===  0.000238 === int32/portable4/version.c compiling
Sun Oct  4 20:55:03 2026 ===  0.025877 === output
> gcc: error: unrecognized command-line option ‘-Qunused-arguments’
> gcc: error: unrecognized command-line option ‘-mavx2’
Sun Oct  4 20:55:03 2026 ===  0.001248 === int32/portable4/version.c compiler exited 1
Sun Oct  4 20:55:03 2026 ===  0.000229 === int32/portable4/implementation.c compiling
Sun Oct  4 20:55:03 2026 ===  0.046809 === output
> gcc: error: unrecognized command-line option ‘-Qunused-arguments’
> gcc: error: unrecognized command-line option ‘-mavx2’
Sun Oct  4 20:55:03 2026 ===  0.001198 === int32/portable4/implementation.c compiler exited 1
Sun Oct  4 20:55:03 2026 ===  0.000230 === int32/portable4/cycles.c compiling
Sun Oct  4 20:55:03 2026 ===  0.060411 === output
> gcc: error: unrecognized command-line option ‘-Qunused-arguments’
> gcc: error: unrecognized command-line option ‘-mavx2’
Sun Oct  4 20:55:03 2026 ===  0.001181 === int32/portable4/cycles.c compiler exited 1
Sun Oct  4 20:55:03 2026 ===  0.000197 === int32/portable4/works.c compiling
Sun Oct  4 20:55:03 2026 ===  0.026635 === output
> gcc: error: unrecognized command-line option ‘-Qunused-arguments’
> gcc: error: unrecognized command-line option ‘-mavx2’
Sun Oct  4 20:55:03 2026 ===  0.001057 === int32/portable4/works.c compiler exited 1
Sun Oct  4 20:55:03 2026 ===  0.011827 === uint32/useint32 compiling gcc -fPIC -Wall -fomit-frame-pointer -fwrapv -O3
Sun Oct  4 20:55:03 2026 ===  0.000798 === uint32/useint32/sort.c compiling
Sun Oct  4 20:55:03 2026 ===  0.162802 === uint32/useint32/compiler.c compiling
Sun Oct  4 20:55:03 2026 ===  0.111016 === uint32/useint32/version.c compiling
Sun Oct  4 20:55:03 2026 ===  0.086269 === uint32/useint32/implementation.c compiling
Sun Oct  4 20:55:03 2026 ===  0.095916 === uint32/useint32/cycles.c compiling
Sun Oct  4 20:55:04 2026 ===  0.310594 === uint32/useint32/works.c compiling
Sun Oct  4 20:55:04 2026 ===  0.365562 === uint32/useint32 compiled gcc -fPIC -Wall -fomit-frame-pointer -fwrapv -O3
Sun Oct  4 20:55:04 2026 ===  0.332573 === uint32/useint32 compiling gcc -fPIC -Wall -fomit-frame-pointer -fwrapv -march=core-avx2 -O3
Sun Oct  4 20:55:04 2026 ===  0.001519 === uint32/useint32/sort.c compiling
Sun Oct  4 20:55:04 2026 ===  0.050999 === output
> cc1: error: unknown value ‘core-avx2’ for ‘-march’
> cc1: note: valid arguments are: armv8-a armv8.1-a armv8.2-a armv8.3-a armv8.4-a armv8.5-a armv8.6-a native
Sun Oct  4 20:55:04 2026 ===  0.004482 === uint32/useint32/sort.c compiler exited 1
Sun Oct  4 20:55:04 2026 ===  0.000263 === uint32/useint32/compiler.c compiling
Sun Oct  4 20:55:04 2026 ===  0.040051 === output
> cc1: error: unknown value ‘core-avx2’ for ‘-march’
> cc1: note: valid arguments are: armv8-a armv8.1-a armv8.2-a armv8.3-a armv8.4-a armv8.5-a armv8.6-a native
Sun Oct  4 20:55:04 2026 ===  0.001184 === uint32/useint32/compiler.c compiler exited 1
Sun Oct  4 20:55:04 2026 ===  0.000215 === uint32/useint32/version.c compiling
Sun Oct  4 20:55:04 2026 ===  0.039788 === output
> cc1: error: unknown value ‘core-avx2’ for ‘-march’
> cc1: note: valid arguments are: armv8-a armv8.1-a armv8.2-a armv8.3-a armv8.4-a armv8.5-a armv8.6-a native
Sun Oct  4 20:55:04 2026 ===  0.001335 === uint32/useint32/version.c compiler exited 1
Sun Oct  4 20:55:04 2026 ===  0.000238 === uint32/useint32/implementation.c compiling
Sun Oct  4 20:55:04 2026 ===  0.053074 === output
> cc1: error: unknown value ‘core-avx2’ for ‘-march’
> cc1: note: valid arguments are: armv8-a armv8.1-a armv8.2-a armv8.3-a armv8.4-a armv8.5-a armv8.6-a native
Sun Oct  4 20:55:04 2026 ===  0.001290 === uint32/useint32/implementation.c compiler exited 1
Sun Oct  4 20:55:04 2026 ===  0.000222 === uint32/useint32/cycles.c compiling
Sun Oct  4 20:55:04 2026 ===  0.048694 === output
> cc1: error: unknown value ‘core-avx2’ for ‘-march’
> cc1: note: valid arguments are: armv8-a armv8.1-a armv8.2-a armv8.3-a armv8.4-a armv8.5-a armv8.6-a native
Sun Oct  4 20:55:04 2026 ===  0.001238 === uint32/useint32/cycles.c compiler exited 1
Sun Oct  4 20:55:04 2026 ===  0.000218 === uint32/useint32/works.c compiling
Sun Oct  4 20:55:05 2026 ===  0.052273 === output
> cc1: error: unknown value ‘core-avx2’ for ‘-march’
> cc1: note: valid arguments are: armv8-a armv8.1-a armv8.2-a armv8.3-a armv8.4-a armv8.5-a armv8.6-a native
Sun Oct  4 20:55:05 2026 ===  0.001416 === uint32/useint32/works.c compiler exited 1
Sun Oct  4 20:55:05 2026 ===  0.000374 === uint32/useint32 compiling clang -fPIC -Wall -fomit-frame-pointer -fwrapv -Qunused-arguments -O3
Sun Oct  4 20:55:05 2026 ===  0.001002 === uint32/useint32/sort.c compiling
Sun Oct  4 20:55:05 2026 ===  0.027673 === output
> gcc: error: unrecognized command-line option ‘-Qunused-arguments’
Sun Oct  4 20:55:05 2026 ===  0.002606 === uint32/useint32/sort.c compiler exited 1
Sun Oct  4 20:55:05 2026 ===  0.000238 === uint32/useint32/compiler.c compiling
Sun Oct  4 20:55:05 2026 ===  0.026748 === output
> gcc: error: unrecognized command-line option ‘-Qunused-arguments’
Sun Oct  4 20:55:05 2026 ===  0.001418 === uint32/useint32/compiler.c compiler exited 1
Sun Oct  4 20:55:05 2026 ===  0.000230 === uint32/useint32/version.c compiling
Sun Oct  4 20:55:05 2026 ===  0.026696 === output
> gcc: error: unrecognized command-line option ‘-Qunused-arguments’
Sun Oct  4 20:55:05 2026 ===  0.001188 === uint32/useint32/version.c compiler exited 1
Sun Oct  4 20:55:05 2026 ===  0.000216 === uint32/useint32/implementation.c compiling
Sun Oct  4 20:55:05 2026 ===  0.024811 === output
> gcc: error: unrecognized command-line option ‘-Qunused-arguments’
Sun Oct  4 20:55:05 2026 ===  0.001152 === uint32/useint32/implementation.c compiler exited 1
Sun Oct  4 20:55:05 2026 ===  0.000215 === uint32/useint32/cycles.c compiling
Sun Oct  4 20:55:05 2026 ===  0.025748 === output
> gcc: error: unrecognized command-line option ‘-Qunused-arguments’
Sun Oct  4 20:55:05 2026 ===  0.001141 === uint32/useint32/cycles.c compiler exited 1
Sun Oct  4 20:55:05 2026 ===  0.000202 === uint32/useint32/works.c compiling
Sun Oct  4 20:55:05 2026 ===  0.031470 === output
> gcc: error: unrecognized command-line option ‘-Qunused-arguments’
Sun Oct  4 20:55:05 2026 ===  0.001214 === uint32/useint32/works.c compiler exited 1
Sun Oct  4 20:55:05 2026 ===  0.000287 === uint32/useint32 compiling clang -fPIC -Wall -fomit-frame-pointer -fwrapv -Qunused-arguments -mavx2 -O3
Sun Oct  4 20:55:05 2026 ===  0.000788 === uint32/useint32/sort.c compiling
Sun Oct  4 20:55:05 2026 ===  0.026203 === output
> gcc: error: unrecognized command-line option ‘-Qunused-arguments’
> gcc: error: unrecognized command-line option ‘-mavx2’
Sun Oct  4 20:55:05 2026 ===  0.002987 === uint32/useint32/sort.c compiler exited 1
Sun Oct  4 20:55:05 2026 ===  0.000238 === uint32/useint32/compiler.c compiling
Sun Oct  4 20:55:05 2026 ===  0.026620 === output
> gcc: error: unrecognized command-line option ‘-Qunused-arguments’
> gcc: error: unrecognized command-line option ‘-mavx2’
Sun Oct  4 20:55:05 2026 ===  0.001125 === uint32/useint32/compiler.c compiler exited 1
Sun Oct  4 20:55:05 2026 ===  0.000195 === uint32/useint32/version.c compiling
Sun Oct  4 20:55:05 2026 ===  0.027853 === output
> gcc: error: unrecognized command-line option ‘-Qunused-arguments’
> gcc: error: unrecognized command-line option ‘-mavx2’
Sun Oct  4 20:55:05 2026 ===  0.001083 === uint32/useint32/version.c compiler exited 1
Sun Oct  4 20:55:05 2026 ===  0.000204 === uint32/useint32/implementation.c compiling
Sun Oct  4 20:55:05 2026 ===  0.029580 === output
> gcc: error: unrecognized command-line option ‘-Qunused-arguments’
> gcc: error: unrecognized command-line option ‘-mavx2’
Sun Oct  4 20:55:05 2026 ===  0.001151 === uint32/useint32/implementation.c compiler exited 1
Sun Oct  4 20:55:05 2026 ===  0.000219 === uint32/useint32/cycles.c compiling
Sun Oct  4 20:55:05 2026 ===  0.039835 === output
> gcc: error: unrecognized command-line option ‘-Qunused-arguments’
> gcc: error: unrecognized command-line option ‘-mavx2’
Sun Oct  4 20:55:05 2026 ===  0.001185 === uint32/useint32/cycles.c compiler exited 1
Sun Oct  4 20:55:05 2026 ===  0.000193 === uint32/useint32/works.c compiling
Sun Oct  4 20:55:05 2026 ===  0.045817 === output
> gcc: error: unrecognized command-line option ‘-Qunused-arguments’
> gcc: error: unrecognized command-line option ‘-mavx2’
Sun Oct  4 20:55:05 2026 ===  0.001091 === uint32/useint32/works.c compiler exited 1
Sun Oct  4 20:55:05 2026 ===  0.011146 === float32/useint32 compiling gcc -fPIC -Wall -fomit-frame-pointer -fwrapv -O3
Sun Oct  4 20:55:05 2026 ===  0.000773 === float32/useint32/sort.c compiling
Sun Oct  4 20:55:05 2026 ===  0.150172 === float32/useint32/compiler.c compiling
Sun Oct  4 20:55:05 2026 ===  0.088227 === float32/useint32/version.c compiling
Sun Oct  4 20:55:05 2026 ===  0.099607 === float32/useint32/implementation.c compiling
Sun Oct  4 20:55:05 2026 ===  0.092587 === float32/useint32/cycles.c compiling
Sun Oct  4 20:55:06 2026 ===  0.271454 === float32/useint32/works.c compiling
Sun Oct  4 20:55:06 2026 ===  0.248124 === float32/useint32 compiled gcc -fPIC -Wall -fomit-frame-pointer -fwrapv -O3
Sun Oct  4 20:55:06 2026 ===  0.117564 === float32/useint32 compiling gcc -fPIC -Wall -fomit-frame-pointer -fwrapv -march=core-avx2 -O3
Sun Oct  4 20:55:06 2026 ===  0.000923 === float32/useint32/sort.c compiling
Sun Oct  4 20:55:06 2026 ===  0.057759 === output
> cc1: error: unknown value ‘core-avx2’ for ‘-march’
> cc1: note: valid arguments are: armv8-a armv8.1-a armv8.2-a armv8.3-a armv8.4-a armv8.5-a armv8.6-a native
Sun Oct  4 20:55:06 2026 ===  0.004649 === float32/useint32/sort.c compiler exited 1
Sun Oct  4 20:55:06 2026 ===  0.000238 === float32/useint32/compiler.c compiling
Sun Oct  4 20:55:06 2026 ===  0.047890 === output
> cc1: error: unknown value ‘core-avx2’ for ‘-march’
> cc1: note: valid arguments are: armv8-a armv8.1-a armv8.2-a armv8.3-a armv8.4-a armv8.5-a armv8.6-a native
Sun Oct  4 20:55:06 2026 ===  0.005883 === float32/useint32/compiler.c compiler exited 1
Sun Oct  4 20:55:06 2026 ===  0.004243 === float32/useint32/version.c compiling
Sun Oct  4 20:55:06 2026 ===  0.047608 === output
> cc1: error: unknown value ‘core-avx2’ for ‘-march’
> cc1: note: valid arguments are: armv8-a armv8.1-a armv8.2-a armv8.3-a armv8.4-a armv8.5-a armv8.6-a native
Sun Oct  4 20:55:06 2026 ===  0.001164 === float32/useint32/version.c compiler exited 1
Sun Oct  4 20:55:06 2026 ===  0.000192 === float32/useint32/implementation.c compiling
Sun Oct  4 20:55:06 2026 ===  0.046164 === output
> cc1: error: unknown value ‘core-avx2’ for ‘-march’
> cc1: note: valid arguments are: armv8-a armv8.1-a armv8.2-a armv8.3-a armv8.4-a armv8.5-a armv8.6-a native
Sun Oct  4 20:55:06 2026 ===  0.001147 === float32/useint32/implementation.c compiler exited 1
Sun Oct  4 20:55:06 2026 ===  0.000182 === float32/useint32/cycles.c compiling
Sun Oct  4 20:55:06 2026 ===  0.037509 === output
> cc1: error: unknown value ‘core-avx2’ for ‘-march’
> cc1: note: valid arguments are: armv8-a armv8.1-a armv8.2-a armv8.3-a armv8.4-a armv8.5-a armv8.6-a native
Sun Oct  4 20:55:06 2026 ===  0.001271 === float32/useint32/cycles.c compiler exited 1
Sun Oct  4 20:55:06 2026 ===  0.000224 === float32/useint32/works.c compiling
Sun Oct  4 20:55:06 2026 ===  0.041301 === output
> cc1: error: unknown value ‘core-avx2’ for ‘-march’
> cc1: note: valid arguments are: armv8-a armv8.1-a armv8.2-a armv8.3-a armv8.4-a armv8.5-a armv8.6-a native
Sun Oct  4 20:55:06 2026 ===  0.001125 === float32/useint32/works.c compiler exited 1
Sun Oct  4 20:55:06 2026 ===  0.000253 === float32/useint32 compiling clang -fPIC -Wall -fomit-frame-pointer -fwrapv -Qunused-arguments -O3
Sun Oct  4 20:55:06 2026 ===  0.000727 === float32/useint32/sort.c compiling
Sun Oct  4 20:55:06 2026 ===  0.026292 === output
> gcc: error: unrecognized command-line option ‘-Qunused-arguments’
Sun Oct  4 20:55:06 2026 ===  0.002479 === float32/useint32/sort.c compiler exited 1
Sun Oct  4 20:55:06 2026 ===  0.000213 === float32/useint32/compiler.c compiling
Sun Oct  4 20:55:06 2026 ===  0.026391 === output
> gcc: error: unrecognized command-line option ‘-Qunused-arguments’
Sun Oct  4 20:55:06 2026 ===  0.001078 === float32/useint32/compiler.c compiler exited 1
Sun Oct  4 20:55:06 2026 ===  0.000204 === float32/useint32/version.c compiling
Sun Oct  4 20:55:06 2026 ===  0.025301 === output
> gcc: error: unrecognized command-line option ‘-Qunused-arguments’
Sun Oct  4 20:55:06 2026 ===  0.001156 === float32/useint32/version.c compiler exited 1
Sun Oct  4 20:55:06 2026 ===  0.000204 === float32/useint32/implementation.c compiling
Sun Oct  4 20:55:06 2026 ===  0.027132 === output
> gcc: error: unrecognized command-line option ‘-Qunused-arguments’
Sun Oct  4 20:55:06 2026 ===  0.001236 === float32/useint32/implementation.c compiler exited 1
Sun Oct  4 20:55:06 2026 ===  0.000208 === float32/useint32/cycles.c compiling
Sun Oct  4 20:55:06 2026 ===  0.026105 === output
> gcc: error: unrecognized command-line option ‘-Qunused-arguments’
Sun Oct  4 20:55:06 2026 ===  0.001214 === float32/useint32/cycles.c compiler exited 1
Sun Oct  4 20:55:06 2026 ===  0.000213 === float32/useint32/works.c compiling
Sun Oct  4 20:55:06 2026 ===  0.031601 === output
> gcc: error: unrecognized command-line option ‘-Qunused-arguments’
Sun Oct  4 20:55:06 2026 ===  0.001191 === float32/useint32/works.c compiler exited 1
Sun Oct  4 20:55:06 2026 ===  0.000263 === float32/useint32 compiling clang -fPIC -Wall -fomit-frame-pointer -fwrapv -Qunused-arguments -mavx2 -O3
Sun Oct  4 20:55:06 2026 ===  0.000873 === float32/useint32/sort.c compiling
Sun Oct  4 20:55:07 2026 ===  0.030937 === output
> gcc: error: unrecognized command-line option ‘-Qunused-arguments’
> gcc: error: unrecognized command-line option ‘-mavx2’
Sun Oct  4 20:55:07 2026 ===  0.003167 === float32/useint32/sort.c compiler exited 1
Sun Oct  4 20:55:07 2026 ===  0.000231 === float32/useint32/compiler.c compiling
Sun Oct  4 20:55:07 2026 ===  0.028021 === output
> gcc: error: unrecognized command-line option ‘-Qunused-arguments’
> gcc: error: unrecognized command-line option ‘-mavx2’
Sun Oct  4 20:55:07 2026 ===  0.001625 === float32/useint32/compiler.c compiler exited 1
Sun Oct  4 20:55:07 2026 ===  0.000219 === float32/useint32/version.c compiling
Sun Oct  4 20:55:07 2026 ===  0.038800 === output
> gcc: error: unrecognized command-line option ‘-Qunused-arguments’
> gcc: error: unrecognized command-line option ‘-mavx2’
Sun Oct  4 20:55:07 2026 ===  0.001203 === float32/useint32/version.c compiler exited 1
Sun Oct  4 20:55:07 2026 ===  0.000223 === float32/useint32/implementation.c compiling
Sun Oct  4 20:55:07 2026 ===  0.037859 === output
> gcc: error: unrecognized command-line option ‘-Qunused-arguments’
> gcc: error: unrecognized command-line option ‘-mavx2’
Sun Oct  4 20:55:07 2026 ===  0.001165 === float32/useint32/implementation.c compiler exited 1
Sun Oct  4 20:55:07 2026 ===  0.000213 === float32/useint32/cycles.c compiling
Sun Oct  4 20:55:07 2026 ===  0.026146 === output
> gcc: error: unrecognized command-line option ‘-Qunused-arguments’
> gcc: error: unrecognized command-line option ‘-mavx2’
Sun Oct  4 20:55:07 2026 ===  0.001157 === float32/useint32/cycles.c compiler exited 1
Sun Oct  4 20:55:07 2026 ===  0.000876 === float32/useint32/works.c compiling
Sun Oct  4 20:55:07 2026 ===  0.025958 === output
> gcc: error: unrecognized command-line option ‘-Qunused-arguments’
> gcc: error: unrecognized command-line option ‘-mavx2’
Sun Oct  4 20:55:07 2026 ===  0.001223 === float32/useint32/works.c compiler exited 1
Sun Oct  4 20:55:07 2026 ===  0.000289 === command/limits.c compiling gcc -fPIC -Wall -fomit-frame-pointer -fwrapv -O3
Sun Oct  4 20:55:07 2026 ===  0.128881 === command/limits.c compiling gcc -fPIC -Wall -fomit-frame-pointer -fwrapv -march=core-avx2 -O3
Sun Oct  4 20:55:07 2026 ===  0.040011 === output
> cc1: error: unknown value ‘core-avx2’ for ‘-march’
> cc1: note: valid arguments are: armv8-a armv8.1-a armv8.2-a armv8.3-a armv8.4-a armv8.5-a armv8.6-a native
Sun Oct  4 20:55:07 2026 ===  0.001671 === command/limits.c compiler exited 1
Sun Oct  4 20:55:07 2026 ===  0.000196 === command/limits.c compiling clang -fPIC -Wall -fomit-frame-pointer -fwrapv -Qunused-arguments -O3
Sun Oct  4 20:55:07 2026 ===  0.030803 === output
> gcc: error: unrecognized command-line option ‘-Qunused-arguments’
Sun Oct  4 20:55:07 2026 ===  0.001504 === command/limits.c compiler exited 1
Sun Oct  4 20:55:07 2026 ===  0.000152 === command/limits.c compiling clang -fPIC -Wall -fomit-frame-pointer -fwrapv -Qunused-arguments -mavx2 -O3
Sun Oct  4 20:55:07 2026 ===  0.029194 === output
> gcc: error: unrecognized command-line option ‘-Qunused-arguments’
> gcc: error: unrecognized command-line option ‘-mavx2’
Sun Oct  4 20:55:07 2026 ===  0.001674 === command/limits.c compiler exited 1
Sun Oct  4 20:55:07 2026 ===  0.004066 === command/int32-speed.c compiling gcc -fPIC -Wall -fomit-frame-pointer -fwrapv -O3
Sun Oct  4 20:55:07 2026 ===  0.330788 === command/int32-speed.c compiling gcc -fPIC -Wall -fomit-frame-pointer -fwrapv -march=core-avx2 -O3
Sun Oct  4 20:55:07 2026 ===  0.036343 === output
> cc1: error: unknown value ‘core-avx2’ for ‘-march’
> cc1: note: valid arguments are: armv8-a armv8.1-a armv8.2-a armv8.3-a armv8.4-a armv8.5-a armv8.6-a native
Sun Oct  4 20:55:07 2026 ===  0.001181 === command/int32-speed.c compiler exited 1
Sun Oct  4 20:55:07 2026 ===  0.000214 === command/int32-speed.c compiling clang -fPIC -Wall -fomit-frame-pointer -fwrapv -Qunused-arguments -O3
Sun Oct  4 20:55:07 2026 ===  0.027510 === output
> gcc: error: unrecognized command-line option ‘-Qunused-arguments’
Sun Oct  4 20:55:07 2026 ===  0.001110 === command/int32-speed.c compiler exited 1
Sun Oct  4 20:55:07 2026 ===  0.000181 === command/int32-speed.c compiling clang -fPIC -Wall -fomit-frame-pointer -fwrapv -Qunused-arguments -mavx2 -O3
Sun Oct  4 20:55:07 2026 ===  0.025604 === output
> gcc: error: unrecognized command-line option ‘-Qunused-arguments’
> gcc: error: unrecognized command-line option ‘-mavx2’
Sun Oct  4 20:55:07 2026 ===  0.001245 === command/int32-speed.c compiler exited 1
Sun Oct  4 20:55:07 2026 ===  0.004834 === command/uint32-speed.c compiling gcc -fPIC -Wall -fomit-frame-pointer -fwrapv -O3
Sun Oct  4 20:55:08 2026 ===  0.229505 === command/uint32-speed.c compiling gcc -fPIC -Wall -fomit-frame-pointer -fwrapv -march=core-avx2 -O3
Sun Oct  4 20:55:08 2026 ===  0.038440 === output
> cc1: error: unknown value ‘core-avx2’ for ‘-march’
> cc1: note: valid arguments are: armv8-a armv8.1-a armv8.2-a armv8.3-a armv8.4-a armv8.5-a armv8.6-a native
Sun Oct  4 20:55:08 2026 ===  0.001178 === command/uint32-speed.c compiler exited 1
Sun Oct  4 20:55:08 2026 ===  0.000198 === command/uint32-speed.c compiling clang -fPIC -Wall -fomit-frame-pointer -fwrapv -Qunused-arguments -O3
Sun Oct  4 20:55:08 2026 ===  0.025203 === output
> gcc: error: unrecognized command-line option ‘-Qunused-arguments’
Sun Oct  4 20:55:08 2026 ===  0.001145 === command/uint32-speed.c compiler exited 1
Sun Oct  4 20:55:08 2026 ===  0.000187 === command/uint32-speed.c compiling clang -fPIC -Wall -fomit-frame-pointer -fwrapv -Qunused-arguments -mavx2 -O3
Sun Oct  4 20:55:08 2026 ===  0.029085 === output
> gcc: error: unrecognized command-line option ‘-Qunused-arguments’
> gcc: error: unrecognized command-line option ‘-mavx2’
Sun Oct  4 20:55:08 2026 ===  0.001203 === command/uint32-speed.c compiler exited 1
Sun Oct  4 20:55:08 2026 ===  0.005220 === command/float32-speed.c compiling gcc -fPIC -Wall -fomit-frame-pointer -fwrapv -O3
Sun Oct  4 20:55:08 2026 ===  0.288821 === command/float32-speed.c compiling gcc -fPIC -Wall -fomit-frame-pointer -fwrapv -march=core-avx2 -O3
Sun Oct  4 20:55:08 2026 ===  0.036952 === output
> cc1: error: unknown value ‘core-avx2’ for ‘-march’
> cc1: note: valid arguments are: armv8-a armv8.1-a armv8.2-a armv8.3-a armv8.4-a armv8.5-a armv8.6-a native
Sun Oct  4 20:55:08 2026 ===  0.001173 === command/float32-speed.c compiler exited 1
Sun Oct  4 20:55:08 2026 ===  0.000198 === command/float32-speed.c compiling clang -fPIC -Wall -fomit-frame-pointer -fwrapv -Qunused-arguments -O3
Sun Oct  4 20:55:08 2026 ===  0.026596 === output
> gcc: error: unrecognized command-line option ‘-Qunused-arguments’
Sun Oct  4 20:55:08 2026 ===  0.001149 === command/float32-speed.c compiler exited 1
Sun Oct  4 20:55:08 2026 ===  0.000192 === command/float32-speed.c compiling clang -fPIC -Wall -fomit-frame-pointer -fwrapv -Qunused-arguments -mavx2 -O3
Sun Oct  4 20:55:08 2026 ===  0.043990 === output
> gcc: error: unrecognized command-line option ‘-Qunused-arguments’
> gcc: error: unrecognized command-line option ‘-mavx2’
Sun Oct  4 20:55:08 2026 ===  0.001322 === command/float32-speed.c compiler exited 1
Sun Oct  4 20:55:08 2026 ===  0.002319 === build finishing successfully
